feat(gitlab): support non-admin tokens with CSV permissions #31188
Triggered via pull request
September 11, 2026 00:54
Status
Failure
Total duration
2m 48s
Artifacts
–
ci.yml
on: pull_request
Detect Version
Migrate Dev DB
/
Apply Database Migrations
Detect Desktop Changes
Matrix: Build AMD64
Matrix: Build ARM64 (GHCR Only)
Matrix: Test and Build / oauth-postgres
Matrix: Test and Build / test-shard
Test and Build
/
Lint and Test
2m 25s
Test and Build
/
Build App
2m 35s
Check Docs Changes
Matrix: Build Dev ECR
Deploy Trigger.dev (Dev)
Matrix: Create GHCR Manifests
Process Docs
/
Process Documentation Embeddings
Prune Desktop Prereleases
0s
Matrix: Attest Images
Desktop Release
/
Build, Sign, Notarize
Annotations
7 errors and 9 warnings
|
Test and Build / Test (shard 3)
Process completed with exit code 1.
|
|
app/workspace/[workspaceId]/search/components/search-source-setup.test.tsx > resuming Search source setup > reopens the source from the URL even when the source filter hides its row:
apps/sim/app/workspace/[workspaceId]/search/components/search-source-setup.test.tsx#L2030
AssertionError: expected 'Add GitLab projectAdd GitLab projectC…' to contain 'Admin or service account'
Expected: "Admin or service account"
Received: "Add GitLab projectAdd GitLab projectCloseAdministrator tokenNon-admin tokenPersonal Access TokenHost*Project*ContentWiki & IssuesMore optionsSetup guideCancelConnect & Sync"
❯ app/workspace/[workspaceId]/search/components/search-source-setup.test.tsx:2030:39
|
|
app/workspace/[workspaceId]/search/components/search-source-setup.test.tsx > canonical Search connector safety > defaults an OAuth source to member accounts and never offers workspace-wide access:
apps/sim/app/workspace/[workspaceId]/search/components/search-source-setup.test.tsx#L1981
AssertionError: expected 'Add GitLab projectAdd GitLab projectC…' to contain 'Admin or service account'
Expected: "Admin or service account"
Received: "Add GitLab projectAdd GitLab projectCloseAdministrator tokenNon-admin tokenPersonal Access TokenHost*Project*ContentWiki & IssuesMore optionsSetup guideCancelConnect & Sync"
❯ app/workspace/[workspaceId]/search/components/search-source-setup.test.tsx:1981:39
|
|
app/workspace/[workspaceId]/search/components/search-source-setup.test.tsx > member content credentials in real add and edit dialogs > submits a deliberately selected dedicated account and clears source-specific state on back:
apps/sim/app/workspace/[workspaceId]/search/components/search-source-setup.test.tsx#L231
AssertionError: Button Workspace: expected undefined to be defined
❯ button app/workspace/[workspaceId]/search/components/search-source-setup.test.tsx:231:36
❯ app/workspace/[workspaceId]/search/components/search-source-setup.test.tsx:1200:12
|
|
app/workspace/[workspaceId]/search/components/search-source-setup.test.tsx > Search source setup with real connector dialogs > opens GitLab with its single central method and submits the custom host and PAT:
apps/sim/app/workspace/[workspaceId]/search/components/search-source-setup.test.tsx#L1031
AssertionError: expected 'Add GitLab projectAdd GitLab projectC…' to contain 'Admin or service account'
Expected: "Admin or service account"
Received: "Add GitLab projectAdd GitLab projectCloseAdministrator tokenNon-admin tokenPersonal Access TokenHost*Project*ContentWiki & IssuesMore optionsSetup guideCancelConnect & Sync"
❯ app/workspace/[workspaceId]/search/components/search-source-setup.test.tsx:1031:39
|
|
Test and Build / Test (shard 3)
@sim/app#test: command (/home/runner/_work/sim/sim/apps/sim) /home/runner/.bun/bin/bun run test exited (1)
|
|
Test and Build / Lint and Test
Process completed with exit code 1.
|
|
Test and Build / Test (shard 3)
Skipping sticky disk commit due to previous step failures
|
|
Test and Build / Test (shard 3)
- Step: unknown (failed)
|
|
Test and Build / Test (shard 3)
Found 2 failed/cancelled steps in previous workflow steps
|
|
Test and Build / Test (shard 3)
Skipping sticky disk commit due to previous step failures
|
|
Test and Build / Test (shard 3)
- Step: unknown (failed)
|
|
Test and Build / Test (shard 3)
Found 2 failed/cancelled steps in previous workflow steps
|
|
Test and Build / Test (shard 3)
Skipping sticky disk commit due to previous step failures
|
|
Test and Build / Test (shard 3)
- Step: unknown (failed)
|
|
Test and Build / Test (shard 3)
Found 2 failed/cancelled steps in previous workflow steps
|