Add Lists operations and improve Canvas support in Slack #32786
Triggered via pull request
September 23, 2026 23:41
Status
Failure
Total duration
5m 15s
Artifacts
–
ci.yml
on: pull_request
Detect Version
0s
Detect Desktop Changes
0s
Prepare Trigger.dev
0s
Matrix: Build AMD64
Matrix: Build Dev ECR
Matrix: Build ARM64 (GHCR Only)
Matrix: Test and Build / oauth-postgres
Matrix: Test and Build / test-shard
Test and Build
/
Lint and Test
30s
Test and Build
/
Build App
2m 5s
Check Docs Changes
0s
Migrate Dev DB
/
Apply Database Migrations
Matrix: Create GHCR Manifests
Process Docs
/
Process Documentation Embeddings
Promote Trigger.dev
Prune Desktop Prereleases
Matrix: Attest Images
Desktop Release
/
Build, Sign, Notarize
Annotations
9 errors and 27 warnings
|
Test and Build / Lint and Test
Process completed with exit code 1.
|
|
Test and Build / Lint and Test
Process completed with exit code 1.
|
|
Test and Build / Build App
Process completed with exit code 1.
|
|
Test and Build / Build App
@sim/app#build: command (/home/runner/_work/sim/sim/apps/sim) /home/runner/.bun/bin/bun run build exited (1)
|
|
Test and Build / Test (shard 2)
Process completed with exit code 1.
|
|
lib/integrations/credential-display.test.ts > resolveCredentialDisplay > uses each vendor own noun for non-family service accounts:
apps/sim/lib/integrations/credential-display.test.ts#L219
AssertionError: expected 'Slack custom bot · Slack, Slack Canva…' to be 'Slack custom bot' // Object.is equality
Expected: "Slack custom bot"
Received: "Slack custom bot · Slack, Slack Canvas, and Slack Lists"
❯ lib/integrations/credential-display.test.ts:219:83
|
|
lib/integrations/credential-display.test.ts > service-account coverage > treats only multi-integration service accounts as families:
apps/sim/lib/integrations/credential-display.test.ts#L186
AssertionError: expected [ 'atlassian-service-account', …(2) ] to deeply equal [ 'atlassian-service-account', …(1) ]
- Expected
+ Received
[
"atlassian-service-account",
"google-service-account",
+ "slack-custom-bot",
]
❯ lib/integrations/credential-display.test.ts:186:22
|
|
lib/integrations/credential-display.test.ts > service-account coverage > slack-custom-bot authenticates the expected integrations:
apps/sim/lib/integrations/credential-display.test.ts#L159
AssertionError: expected [ 'slack', 'slack-canvas', …(1) ] to deeply equal [ 'slack' ]
- Expected
+ Received
[
"slack",
+ "slack-canvas",
+ "slack-lists",
]
❯ lib/integrations/credential-display.test.ts:159:21
|
|
Test and Build / Test (shard 2)
@sim/app#test: command (/home/runner/_work/sim/sim/apps/sim) /home/runner/.bun/bin/bun run test exited (1)
|
|
Test and Build / Lint and Test
Skipping sticky disk commit due to previous step failures
|
|
Test and Build / Lint and Test
- Step: unknown (failed)
|
|
Test and Build / Lint and Test
Found 2 failed/cancelled steps in previous workflow steps
|
|
Test and Build / Lint and Test
Skipping sticky disk commit due to previous step failures
|
|
Test and Build / Lint and Test
- Step: unknown (failed)
|
|
Test and Build / Lint and Test
Found 2 failed/cancelled steps in previous workflow steps
|
|
Test and Build / Lint and Test
Skipping sticky disk commit due to previous step failures
|
|
Test and Build / Lint and Test
- Step: unknown (failed)
|
|
Test and Build / Lint and Test
Found 2 failed/cancelled steps in previous workflow steps
|
|
Test and Build / Build App
Skipping sticky disk commit due to previous step failures
|
|
Test and Build / Build App
- Step: unknown (failed)
|
|
Test and Build / Build App
Found 2 failed/cancelled steps in previous workflow steps
|
|
Test and Build / Build App
Skipping sticky disk commit due to previous step failures
|
|
Test and Build / Build App
- Step: unknown (failed)
|
|
Test and Build / Build App
Found 2 failed/cancelled steps in previous workflow steps
|
|
Test and Build / Build App
Skipping sticky disk commit due to previous step failures
|
|
Test and Build / Build App
- Step: unknown (failed)
|
|
Test and Build / Build App
Found 2 failed/cancelled steps in previous workflow steps
|
|
Test and Build / Test (shard 2)
Skipping sticky disk commit due to previous step failures
|
|
Test and Build / Test (shard 2)
- Step: unknown (failed)
|
|
Test and Build / Test (shard 2)
Found 2 failed/cancelled steps in previous workflow steps
|
|
Test and Build / Test (shard 2)
Skipping sticky disk commit due to previous step failures
|
|
Test and Build / Test (shard 2)
- Step: unknown (failed)
|
|
Test and Build / Test (shard 2)
Found 2 failed/cancelled steps in previous workflow steps
|
|
Test and Build / Test (shard 2)
Skipping sticky disk commit due to previous step failures
|
|
Test and Build / Test (shard 2)
- Step: unknown (failed)
|
|
Test and Build / Test (shard 2)
Found 2 failed/cancelled steps in previous workflow steps
|