Skip to content

Add gated native macOS computer use to Mothership desktop #32925

Add gated native macOS computer use to Mothership desktop

Add gated native macOS computer use to Mothership desktop #32925

Triggered via pull request September 24, 2026 20:48
Status Failure
Total duration 7m 6s
Artifacts –

ci.yml

on: pull_request
Detect Version
0s
Detect Version
Detect Desktop Changes
0s
Detect Desktop Changes
Prepare Trigger.dev
0s
Prepare Trigger.dev
Matrix: Build AMD64
Matrix: Build Dev ECR
Matrix: Build ARM64 (GHCR Only)
Matrix: Test and Build / oauth-postgres
Matrix: Test and Build / test-shard
Test and Build  /  Lint and Test
1m 32s
Test and Build / Lint and Test
Test and Build  /  Build App
5m 29s
Test and Build / Build App
Check Docs Changes
0s
Check Docs Changes
Migrate Dev DB  /  Apply Database Migrations
Migrate Dev DB / Apply Database Migrations
Check Desktop Signing Secrets
0s
Check Desktop Signing Secrets
Migrate DB  /  Apply Database Migrations
Migrate DB / Apply Database Migrations
Create Desktop Prerelease
0s
Create Desktop Prerelease
Promote Images
Promote Images
Desktop Prerelease Build  /  Build, Sign, Notarize
Desktop Prerelease Build / Build, Sign, Notarize
Matrix: Create GHCR Manifests
Process Docs  /  Process Documentation Embeddings
Process Docs / Process Documentation Embeddings
Promote Trigger.dev
0s
Promote Trigger.dev
Publish Desktop Prerelease
Publish Desktop Prerelease
Resolve Attestation Subjects
0s
Resolve Attestation Subjects
Prune Desktop Prereleases
Prune Desktop Prereleases
Matrix: Attest Images
Create GitHub Release
0s
Create GitHub Release
Desktop Release  /  Build, Sign, Notarize
Desktop Release / Build, Sign, Notarize
Fit to window
Zoom out
Zoom in

Annotations

7 errors and 12 warnings
Test and Build / Lint and Test
Process completed with exit code 1.
check:permission-group-enforcement
audit failed — see the group above
Test and Build / Lint and Test
Process completed with exit code 1.
Test and Build / PostgreSQL integration (push)
Process completed with exit code 1.
lib/knowledge/__integration__/knowledge-projection.integration.ts > a async writer > makes a new chunk searchable, at once or once the projector runs: apps/sim/lib/knowledge/__integration__/knowledge-projection.integration.ts#L520
AssertionError: expected [ Array(1) ] to deeply equal [ …(2) ] - Expected + Received [ "06aab10f-865c-4509-8bcf-fdc736e1b3ec", - "187c6e15-b582-4f08-8b08-277ead5ad259", ] ❯ lib/knowledge/__integration__/knowledge-projection.integration.ts:520:31
lib/knowledge/__integration__/knowledge-projection.integration.ts > a sync writer > makes a new chunk searchable, at once or once the projector runs: apps/sim/lib/knowledge/__integration__/knowledge-projection.integration.ts#L513
AssertionError: expected [ Array(1) ] to deeply equal [ …(2) ] - Expected + Received [ "13dc85d2-647b-4519-b915-2c5c6a8a43e2", - "187c6e15-b582-4f08-8b08-277ead5ad259", ] ❯ lib/knowledge/__integration__/knowledge-projection.integration.ts:513:33
lib/knowledge/__integration__/knowledge-projection.integration.ts > a sync writer > serves a new grant before the projector runs, on both rankings: apps/sim/lib/knowledge/__integration__/knowledge-projection.integration.ts#L473
AssertionError: expected [] to deeply equal [ Array(1) ] - Expected + Received - [ - "187c6e15-b582-4f08-8b08-277ead5ad259", - ] + [] ❯ lib/knowledge/__integration__/knowledge-projection.integration.ts:473:31
Test and Build / Lint and Test
Skipping sticky disk commit due to previous step failures
Test and Build / Lint and Test
- Step: unknown (failed)
Test and Build / Lint and Test
Found 2 failed/cancelled steps in previous workflow steps
Test and Build / Lint and Test
Skipping sticky disk commit due to previous step failures
Test and Build / Lint and Test
- Step: unknown (failed)
Test and Build / Lint and Test
Found 2 failed/cancelled steps in previous workflow steps
Test and Build / Lint and Test
Skipping sticky disk commit due to previous step failures
Test and Build / Lint and Test
- Step: unknown (failed)
Test and Build / Lint and Test
Found 2 failed/cancelled steps in previous workflow steps
Test and Build / PostgreSQL integration (push)
Skipping sticky disk commit due to previous step failures
Test and Build / PostgreSQL integration (push)
- Step: unknown (failed)
Test and Build / PostgreSQL integration (push)
Found 2 failed/cancelled steps in previous workflow steps