Gate Search Assistant integration lookups with AppConfig #33085
ci.yml
on: pull_request
Detect Version
Detect Desktop Changes
Prepare Trigger.dev
Matrix: Build AMD64
Matrix: Build Dev ECR
Matrix: Build ARM64 (GHCR Only)
Matrix: Test and Build / oauth-postgres
Test and Build
/
Lint and Test
6m 44s
Test and Build
/
Build App
40s
Check Docs Changes
Migrate Dev DB
/
Apply Database Migrations
Matrix: Create GHCR Manifests
Process Docs
/
Process Documentation Embeddings
Promote Trigger.dev
Prune Desktop Prereleases
Matrix: Attest Images
Desktop Release
/
Build, Sign, Notarize
Annotations
11 errors and 11 warnings
|
Test and Build / Lint and Test
Process completed with exit code 1.
|
|
tools/slack/oauth-scopes.test.ts > Slack personal-token scope policy > requires the personal writing scope for slack_delete_message:
apps/sim/tools/slack/oauth-scopes.test.ts#L33
AssertionError: expected false to be true // Object.is equality
- Expected
+ Received
- true
+ false
❯ tools/slack/oauth-scopes.test.ts:33:57
|
|
tools/slack/oauth-scopes.test.ts > Slack personal-token scope policy > requires the personal writing scope for slack_update_message:
apps/sim/tools/slack/oauth-scopes.test.ts#L33
AssertionError: expected false to be true // Object.is equality
- Expected
+ Received
- true
+ false
❯ tools/slack/oauth-scopes.test.ts:33:57
|
|
tools/slack/oauth-scopes.test.ts > Slack personal-token scope policy > requires the personal writing scope for slack_message:
apps/sim/tools/slack/oauth-scopes.test.ts#L33
AssertionError: expected false to be true // Object.is equality
- Expected
+ Received
- true
+ false
❯ tools/slack/oauth-scopes.test.ts:33:57
|
|
tools/slack/oauth-scopes.test.ts > Slack personal-token scope policy > lets Slack evaluate conversation-specific scope alternatives for slack_get_thread_replies:
apps/sim/tools/slack/oauth-scopes.test.ts#L26
AssertionError: expected false to be true // Object.is equality
- Expected
+ Received
- true
+ false
❯ tools/slack/oauth-scopes.test.ts:26:55
|
|
tools/slack/oauth-scopes.test.ts > Slack personal-token scope policy > lets Slack evaluate conversation-specific scope alternatives for slack_get_thread:
apps/sim/tools/slack/oauth-scopes.test.ts#L26
AssertionError: expected false to be true // Object.is equality
- Expected
+ Received
- true
+ false
❯ tools/slack/oauth-scopes.test.ts:26:55
|
|
tools/slack/oauth-scopes.test.ts > Slack personal-token scope policy > lets Slack evaluate conversation-specific scope alternatives for slack_get_channel_history:
apps/sim/tools/slack/oauth-scopes.test.ts#L26
AssertionError: expected false to be true // Object.is equality
- Expected
+ Received
- true
+ false
❯ tools/slack/oauth-scopes.test.ts:26:55
|
|
lib/atlassian/assistant.test.ts > Atlassian Assistant resource selection > offers confluence operations with a site selector and personal credential:
apps/sim/lib/atlassian/assistant.test.ts#L41
AssertionError: confluence_add_label: expected false to be true // Object.is equality
- Expected
+ Received
- true
+ false
❯ lib/atlassian/assistant.test.ts:41:60
|
|
lib/atlassian/assistant.test.ts > Atlassian Assistant resource selection > offers jira operations with a site selector and personal credential:
apps/sim/lib/atlassian/assistant.test.ts#L41
AssertionError: jira_add_attachment: expected false to be true // Object.is equality
- Expected
+ Received
- true
+ false
❯ lib/atlassian/assistant.test.ts:41:60
|
|
Test and Build / Lint and Test
@sim/app#test: command (/home/runner/_work/sim/sim/apps/sim) /home/runner/.bun/bin/bun run test exited (1)
|
|
Test and Build / Lint and Test
Process completed with exit code 1.
|
|
Test and Build / Lint and Test
Skipping sticky disk commit due to previous step failures
|
|
Test and Build / Lint and Test
- Step: unknown (failed)
|
|
Test and Build / Lint and Test
Found 2 failed/cancelled steps in previous workflow steps
|
|
Test and Build / Lint and Test
Skipping sticky disk commit due to previous step failures
|
|
Test and Build / Lint and Test
- Step: unknown (failed)
|
|
Test and Build / Lint and Test
Found 2 failed/cancelled steps in previous workflow steps
|
|
Test and Build / Lint and Test
Skipping sticky disk commit due to previous step failures
|
|
Test and Build / Lint and Test
- Step: unknown (failed)
|
|
Test and Build / Lint and Test
Found 2 failed/cancelled steps in previous workflow steps
|
|
Test and Build / PostgreSQL integration (migrate)
Node.js 20 is deprecated. The following actions target Node.js 20 but are being forced to run on Node.js 24: actions/upload-artifact@ea165f8d65b6e75b540449e92b4886f43607fa02. For more information see: https://github.blog/changelog/2025-09-19-deprecation-of-node-20-on-github-actions-runners/
|
|
Test and Build / PostgreSQL integration (push)
Node.js 20 is deprecated. The following actions target Node.js 20 but are being forced to run on Node.js 24: actions/upload-artifact@ea165f8d65b6e75b540449e92b4886f43607fa02. For more information see: https://github.blog/changelog/2025-09-19-deprecation-of-node-20-on-github-actions-runners/
|
Artifacts
Produced during runtime
| Name | Size | Digest | |
|---|---|---|---|
|
integration-reports-migrate
|
55.8 KB |
sha256:6293c6eaf8d7bf7667a9f292ff93e4b03142df95c5b69092d915495aa1cd9a25
|
|
|
integration-reports-push
|
56.6 KB |
sha256:20dbaddf6e2dabe4b898ef3da340cd7e4166490f869a98ea0205f6c6e08a4466
|
|