Skip to content

Gate Search Assistant integration lookups with AppConfig #33092

Gate Search Assistant integration lookups with AppConfig

Gate Search Assistant integration lookups with AppConfig #33092

Triggered via pull request September 25, 2026 18:18
Status Cancelled
Total duration 6m 6s
Artifacts –

ci.yml

on: pull_request
Detect Version
Detect Version
Detect Desktop Changes
Detect Desktop Changes
Prepare Trigger.dev
Prepare Trigger.dev
Matrix: Build AMD64
Matrix: Build Dev ECR
Matrix: Build ARM64 (GHCR Only)
Matrix: Test and Build / oauth-postgres
Matrix: Test and Build / test-shard
Test and Build  /  Lint and Test
3m 47s
Test and Build / Lint and Test
Test and Build  /  Build App
3m 59s
Test and Build / Build App
Check Docs Changes
Check Docs Changes
Migrate Dev DB  /  Apply Database Migrations
Migrate Dev DB / Apply Database Migrations
Check Desktop Signing Secrets
Check Desktop Signing Secrets
Migrate DB  /  Apply Database Migrations
Migrate DB / Apply Database Migrations
Create Desktop Prerelease
0s
Create Desktop Prerelease
Promote Images
Promote Images
Desktop Prerelease Build  /  Build, Sign, Notarize
Desktop Prerelease Build / Build, Sign, Notarize
Matrix: Create GHCR Manifests
Process Docs  /  Process Documentation Embeddings
Process Docs / Process Documentation Embeddings
Promote Trigger.dev
Promote Trigger.dev
Publish Desktop Prerelease
0s
Publish Desktop Prerelease
Resolve Attestation Subjects
0s
Resolve Attestation Subjects
Prune Desktop Prereleases
0s
Prune Desktop Prereleases
Matrix: Attest Images
Create GitHub Release
0s
Create GitHub Release
Desktop Release  /  Build, Sign, Notarize
Desktop Release / Build, Sign, Notarize
Fit to window
Zoom out
Zoom in

Annotations

20 errors and 21 warnings
Test and Build / Test (shard 3)
Process completed with exit code 1.
app/api/selectors/execute/route.test.ts > POST /api/selectors/execute > uses authenticated per-user admission control: apps/sim/app/api/selectors/execute/route.test.ts#L90
AssertionError: expected "vi.fn()" to be called with arguments: [ { bucketName: 'selectors.execute' } ] Number of calls: 0 ❯ app/api/selectors/execute/route.test.ts:90:33
lib/pptx-renderer/renderer/echarts-runtime.test.ts > PPTX ECharts runtime > registers only the chart modules used by PPTX rendering: apps/sim/lib/pptx-renderer/renderer/echarts-runtime.test.ts#L74
AssertionError: expected "vi.fn()" to be called once, but got 0 times ❯ lib/pptx-renderer/renderer/echarts-runtime.test.ts:74:23
Test and Build / Test (shard 3)
@sim/app#test: command (/home/runner/_work/sim/sim/apps/sim) /home/runner/.bun/bin/bun run test exited (1)
Test and Build / Test (shard 2)
Process completed with exit code 1.
Test and Build / Test (shard 2)
@sim/app#test: command (/home/runner/_work/sim/sim/apps/sim) /home/runner/.bun/bin/bun run test exited (1)
Test and Build / Lint and Test
Process completed with exit code 1.
lib/terminal/transport.test.ts > terminal transport chat scopes > applies native suspension pushes to the matching renderer scope: apps/sim/lib/terminal/transport.test.ts#L268
TypeError: Cannot read properties of undefined (reading '0') ❯ lib/terminal/transport.test.ts:268:50
lib/terminal/transport.test.ts > terminal transport chat scopes > routes pushed tab and command state to the scope carried by each event: apps/sim/lib/terminal/transport.test.ts#L247
TypeError: Cannot read properties of undefined (reading '0') ❯ lib/terminal/transport.test.ts:247:44
lib/browser-agent/transport.test.ts > browser panel transport > applies native suspension pushes to the matching renderer scope: apps/sim/lib/browser-agent/transport.test.ts#L695
TypeError: Cannot read properties of undefined (reading '0') ❯ lib/browser-agent/transport.test.ts:695:50
lib/browser-agent/transport.test.ts > browser panel transport > routes late browser events to the scope carried by the event: apps/sim/lib/browser-agent/transport.test.ts#L655
TypeError: Cannot read properties of undefined (reading '0') ❯ lib/browser-agent/transport.test.ts:655:49
lib/billing/checkout-admission.test.ts > checkout admission > uses durable, short-lived database claims: apps/sim/lib/billing/checkout-admission.test.ts#L42
AssertionError: expected "vi.fn()" to be called with arguments: [ { …(6) } ] Number of calls: 0 ❯ lib/billing/checkout-admission.test.ts:42:36
Test and Build / Lint and Test
@sim/app#test: command (/home/runner/_work/sim/sim/apps/sim) /home/runner/.bun/bin/bun run test exited (1)
Test and Build / Lint and Test
Process completed with exit code 1.
Test and Build / PostgreSQL integration (migrate)
Canceling since a higher priority waiting request for ci-refs/pull/8301/merge exists
Test and Build / PostgreSQL integration (migrate)
The operation was canceled.
Test and Build / PostgreSQL integration (push)
Canceling since a higher priority waiting request for ci-refs/pull/8301/merge exists
CI
Canceling since a higher priority waiting request for ci-refs/pull/8301/merge exists
CI
Canceling since a higher priority waiting request for ci-refs/pull/8301/merge exists
Test and Build / Test (shard 3)
Skipping sticky disk commit due to previous step failures
Test and Build / Test (shard 3)
Found 2 failed/cancelled steps in previous workflow steps
Test and Build / Test (shard 3)
Skipping sticky disk commit due to previous step failures
Test and Build / Test (shard 3)
Found 2 failed/cancelled steps in previous workflow steps
Test and Build / Test (shard 3)
Skipping sticky disk commit due to previous step failures
Test and Build / Test (shard 3)
Found 2 failed/cancelled steps in previous workflow steps
Test and Build / Test (shard 2)
Skipping sticky disk commit due to previous step failures
Test and Build / Test (shard 2)
- Step: unknown (failed)
Test and Build / Test (shard 2)
Found 2 failed/cancelled steps in previous workflow steps
Test and Build / Test (shard 2)
Skipping sticky disk commit due to previous step failures
Test and Build / Test (shard 2)
- Step: unknown (failed)
Test and Build / Test (shard 2)
Found 2 failed/cancelled steps in previous workflow steps
Test and Build / Test (shard 2)
Skipping sticky disk commit due to previous step failures
Test and Build / Test (shard 2)
- Step: unknown (failed)
Test and Build / Test (shard 2)
Found 2 failed/cancelled steps in previous workflow steps
Test and Build / Lint and Test
Skipping sticky disk commit due to previous step failures
Test and Build / Lint and Test
Found 2 failed/cancelled steps in previous workflow steps
Test and Build / Lint and Test
Skipping sticky disk commit due to previous step failures
Test and Build / Lint and Test
Found 2 failed/cancelled steps in previous workflow steps
Test and Build / Lint and Test
Skipping sticky disk commit due to previous step failures
Test and Build / Lint and Test
Found 2 failed/cancelled steps in previous workflow steps