Skip to content

feat(otter): add Otter.ai integration with triggers and knowledge base connector #33391

feat(otter): add Otter.ai integration with triggers and knowledge base connector

feat(otter): add Otter.ai integration with triggers and knowledge base connector #33391

Triggered via pull request September 28, 2026 18:06
Status Failure
Total duration 10m 47s
Artifacts 2

ci.yml

on: pull_request
Detect Version
Detect Version
Detect Desktop Changes
Detect Desktop Changes
Prepare Trigger.dev
0s
Prepare Trigger.dev
Matrix: Build AMD64
Matrix: Build Dev ECR
Matrix: Build ARM64 (GHCR Only)
Matrix: Test and Build / oauth-postgres
Test and Build  /  Lint and Test
5m 57s
Test and Build / Lint and Test
Test and Build  /  Build App
4m 6s
Test and Build / Build App
Check Docs Changes
Check Docs Changes
Migrate Dev DB  /  Apply Database Migrations
Migrate Dev DB / Apply Database Migrations
Check Desktop Signing Secrets
0s
Check Desktop Signing Secrets
Migrate DB  /  Apply Database Migrations
Migrate DB / Apply Database Migrations
Create Desktop Prerelease
0s
Create Desktop Prerelease
Promote Images
0s
Promote Images
Desktop Prerelease Build  /  Build, Sign, Notarize
Desktop Prerelease Build / Build, Sign, Notarize
Matrix: Create GHCR Manifests
Process Docs  /  Process Documentation Embeddings
Process Docs / Process Documentation Embeddings
Promote Trigger.dev
0s
Promote Trigger.dev
Publish Desktop Prerelease
Publish Desktop Prerelease
Resolve Attestation Subjects
Resolve Attestation Subjects
Prune Desktop Prereleases
0s
Prune Desktop Prereleases
Matrix: Attest Images
Create GitHub Release
Create GitHub Release
Desktop Release  /  Build, Sign, Notarize
Desktop Release / Build, Sign, Notarize
Fit to window
Zoom out
Zoom in

Annotations

6 errors and 8 warnings
Test and Build / Lint and Test
Process completed with exit code 1.
lib/sim-search/live/application.test.ts > authorized live retrieval > rejects a read cancelled with a TimeoutError instead of returning partial discussion coverage: apps/sim/lib/sim-search/live/application.test.ts#L538
AssertionError: expected Error: Drive does not allow downloading t… { …(3) } to be DOMException{ stack: 'TimeoutError: …' } // Object.is equality - Expected + Received - TimeoutError { - "message": "The operation timed out.", + NativeSearchError { + "message": "Drive does not allow downloading this file. Ask the owner to allow downloads or open the source.", + "status": "unavailable", + "retryAfterSeconds": undefined, + "httpStatus": undefined, } ❯ lib/sim-search/live/application.test.ts:538:7
lib/sim-search/live/application.test.ts > authorized live retrieval > rejects a read cancelled with an AbortError instead of returning partial discussion coverage: apps/sim/lib/sim-search/live/application.test.ts#L538
AssertionError: expected Error: Drive does not allow downloading t… { …(3) } to be DOMException{ stack: 'AbortError: Th…' } // Object.is equality - Expected + Received - AbortError { - "message": "The operation was aborted.", + NativeSearchError { + "message": "Drive does not allow downloading this file. Ask the owner to allow downloads or open the source.", + "status": "unavailable", + "retryAfterSeconds": undefined, + "httpStatus": undefined, } ❯ lib/sim-search/live/application.test.ts:538:7
lib/sim-search/live/application.test.ts > authorized live retrieval > rejects a read cancelled with a stop reason instead of returning partial discussion coverage: apps/sim/lib/sim-search/live/application.test.ts#L538
AssertionError: expected Error: Drive does not allow downloading t… { …(3) } to be 'user_stop:test' // Object.is equality - Expected: "user_stop:test" + Received: NativeSearchError { "message": "Drive does not allow downloading this file. Ask the owner to allow downloads or open the source.", "status": "unavailable", "retryAfterSeconds": undefined, "httpStatus": undefined, } ❯ lib/sim-search/live/application.test.ts:538:7
Test and Build / Lint and Test
@sim/app#test: command (/home/runner/_work/sim/sim/apps/sim) /home/runner/.bun/bin/bun run test exited (1)
Test and Build / Lint and Test
Process completed with exit code 1.
Test and Build / Lint and Test
Skipping sticky disk commit due to previous step failures
Test and Build / Lint and Test
Found 2 failed/cancelled steps in previous workflow steps
Test and Build / Lint and Test
Skipping sticky disk commit due to previous step failures
Test and Build / Lint and Test
Found 2 failed/cancelled steps in previous workflow steps
Test and Build / Lint and Test
Skipping sticky disk commit due to previous step failures
Test and Build / Lint and Test
Found 2 failed/cancelled steps in previous workflow steps
Test and Build / PostgreSQL integration (push)
Node.js 20 is deprecated. The following actions target Node.js 20 but are being forced to run on Node.js 24: actions/upload-artifact@ea165f8d65b6e75b540449e92b4886f43607fa02. For more information see: https://github.blog/changelog/2025-09-19-deprecation-of-node-20-on-github-actions-runners/
Test and Build / PostgreSQL integration (migrate)
Node.js 20 is deprecated. The following actions target Node.js 20 but are being forced to run on Node.js 24: actions/upload-artifact@ea165f8d65b6e75b540449e92b4886f43607fa02. For more information see: https://github.blog/changelog/2025-09-19-deprecation-of-node-20-on-github-actions-runners/

Artifacts

Produced during runtime
Name Size Digest
integration-reports-migrate
61.2 KB
sha256:89665960e29d51bf85fc630fca25d332c65c27caedda8092cc7e4ae9e8651ca3
integration-reports-push
61.9 KB
sha256:c751d00b4d076d6d19f21b5512244881c2b17f4e678c6c02d9c64246f37c9cac