Skip to content

fix(search): retire legacy embeddings through scoped backfill #33603

fix(search): retire legacy embeddings through scoped backfill

fix(search): retire legacy embeddings through scoped backfill #33603

Triggered via pull request September 29, 2026 21:25
Status Cancelled
Total duration 10m 20s
Artifacts 2

ci.yml

on: pull_request
Detect Version
0s
Detect Version
Detect Desktop Changes
0s
Detect Desktop Changes
Prepare Trigger.dev
Prepare Trigger.dev
Matrix: Build AMD64
Matrix: Build Dev ECR
Matrix: Build ARM64 (GHCR Only)
Matrix: Test and Build / oauth-postgres
Test and Build  /  Lint and Test
8m 37s
Test and Build / Lint and Test
Test and Build  /  Build App
3m 20s
Test and Build / Build App
Check Docs Changes
Check Docs Changes
Migrate Dev DB  /  Apply Database Migrations
Migrate Dev DB / Apply Database Migrations
Check Desktop Signing Secrets
0s
Check Desktop Signing Secrets
Migrate DB  /  Apply Database Migrations
Migrate DB / Apply Database Migrations
Create Desktop Prerelease
Create Desktop Prerelease
Promote Images
Promote Images
Desktop Prerelease Build  /  Build, Sign, Notarize
Desktop Prerelease Build / Build, Sign, Notarize
Matrix: Create GHCR Manifests
Process Docs  /  Process Documentation Embeddings
Process Docs / Process Documentation Embeddings
Promote Trigger.dev
Promote Trigger.dev
Publish Desktop Prerelease
Publish Desktop Prerelease
Resolve Attestation Subjects
Resolve Attestation Subjects
Prune Desktop Prereleases
Prune Desktop Prereleases
Matrix: Attest Images
Create GitHub Release
0s
Create GitHub Release
Desktop Release  /  Build, Sign, Notarize
Desktop Release / Build, Sign, Notarize
Fit to window
Zoom out
Zoom in

Annotations

15 errors and 19 warnings
Test and Build / PostgreSQL integration (push)
Process completed with exit code 1.
Test and Build / PostgreSQL integration (migrate)
Process completed with exit code 1.
Test and Build / Lint and Test
Canceling since a higher priority waiting request for ci-refs/pull/8430/merge exists
Test and Build / Lint and Test
Process completed with exit code 1.
lib/knowledge/documents/processing-queue.test.ts > processDocumentsWithQueue billing attribution > rejects a knowledge base without a workspace or organization owner: apps/sim/lib/knowledge/documents/processing-queue.test.ts#L146
AssertionError: expected [Function] to throw error including 'Document processing requires a worksp…' but got 'Knowledge base knowledge-base-1 not f…' Expected: "Document processing requires a workspace or organization owner" Received: "Knowledge base knowledge-base-1 not found for document processing" ❯ lib/knowledge/documents/processing-queue.test.ts:146:5
lib/knowledge/documents/processing-queue.test.ts > processDocumentsWithQueue billing attribution > rejects mismatched workspace attribution without enqueueing: apps/sim/lib/knowledge/documents/processing-queue.test.ts#L128
AssertionError: expected [Function] to throw error including 'Document processing workspace does no…' but got 'Knowledge base knowledge-base-1 not f…' Expected: "Document processing workspace does not match billing attribution" Received: "Knowledge base knowledge-base-1 not found for document processing" ❯ lib/knowledge/documents/processing-queue.test.ts:128:5
lib/knowledge/documents/processing-queue.test.ts > processDocumentsWithQueue billing attribution > rejects missing workspace attribution without enqueueing: apps/sim/lib/knowledge/documents/processing-queue.test.ts#L105
AssertionError: expected [Function] to throw error including 'Workspace document processing require…' but got 'Knowledge base knowledge-base-1 not f…' Expected: "Workspace document processing requires a billing attribution snapshot" Received: "Knowledge base knowledge-base-1 not found for document processing" ❯ lib/knowledge/documents/processing-queue.test.ts:105:5
lib/knowledge/documents/document-processing-source.test.ts > in-process quota continuation dispatch > keeps a claimed direct dispatch accepted when quota continuation handoff fails: apps/sim/lib/knowledge/documents/document-processing-source.test.ts#L1225
AssertionError: expected undefined to match object { processingStatus: 'failed', …(1) } - Expected: { "processingDeferredUntil": null, "processingStatus": "failed", } + Received: undefined ❯ lib/knowledge/documents/document-processing-source.test.ts:1225:26
lib/knowledge/documents/document-processing-source.test.ts > in-process quota continuation dispatch > durably defers quota exhaustion in direct mode before reporting acceptance: apps/sim/lib/knowledge/documents/document-processing-source.test.ts#L1134
AssertionError: expected "vi.fn()" to be called with arguments: [ ObjectContaining{…} ] Number of calls: 0 ❯ lib/knowledge/documents/document-processing-source.test.ts:1134:35
Test and Build / Lint and Test
@sim/app#test: command (/home/runner/_work/sim/sim/apps/sim) /home/runner/.bun/bin/bun run test exited (1)
Test and Build / Lint and Test
Process completed with exit code 1.
Test and Build / Build App
Canceling since a higher priority waiting request for ci-refs/pull/8430/merge exists
Test and Build / Build App
The operation was canceled.
CI
Canceling since a higher priority waiting request for ci-refs/pull/8430/merge exists
CI
Canceling since a higher priority waiting request for ci-refs/pull/8430/merge exists
Test and Build / PostgreSQL integration (push)
Node.js 20 is deprecated. The following actions target Node.js 20 but are being forced to run on Node.js 24: actions/upload-artifact@ea165f8d65b6e75b540449e92b4886f43607fa02. For more information see: https://github.blog/changelog/2025-09-19-deprecation-of-node-20-on-github-actions-runners/
Test and Build / PostgreSQL integration (push)
Skipping sticky disk commit due to previous step failures
Test and Build / PostgreSQL integration (push)
- Step: unknown (failed)
Test and Build / PostgreSQL integration (push)
Found 2 failed/cancelled steps in previous workflow steps
Test and Build / PostgreSQL integration (migrate)
Node.js 20 is deprecated. The following actions target Node.js 20 but are being forced to run on Node.js 24: actions/upload-artifact@ea165f8d65b6e75b540449e92b4886f43607fa02. For more information see: https://github.blog/changelog/2025-09-19-deprecation-of-node-20-on-github-actions-runners/
Test and Build / PostgreSQL integration (migrate)
Error getting sticky disk: ConnectError: [deadline_exceeded] failed to expose and mount sticky disk: failed to get sticky disk: Get "https://api.blacksmith.sh/stickydisks?arch=amd64&installation_model_id=7445&region=us-west&repo_name=simstudioai%2Fsim&stickydisk_key=simstudioai%2Fsim-bun-cache-pull_request&type=stickydisk": context deadline exceeded (Client.Timeout exceeded while awaiting headers)
Test and Build / Lint and Test
Error getting sticky disk: ConnectError: [deadline_exceeded] failed to expose and mount sticky disk: failed to get sticky disk: Get "https://api.blacksmith.sh/stickydisks?arch=amd64&installation_model_id=7445&region=us-west&repo_name=simstudioai%2Fsim&stickydisk_key=simstudioai%2Fsim-turbo-cache-pull_request&type=stickydisk": context deadline exceeded (Client.Timeout exceeded while awaiting headers)
Test and Build / Lint and Test
Error getting sticky disk: ConnectError: [deadline_exceeded] failed to expose and mount sticky disk: failed to get sticky disk: Get "https://api.blacksmith.sh/stickydisks?arch=amd64&installation_model_id=7445&region=us-west&repo_name=simstudioai%2Fsim&stickydisk_key=simstudioai%2Fsim-node-modules-pull_request-8fc082a04ac067c76618eb75c0db294478d73473b7f3779a74248a3c9ffdb1ee&type=stickydisk": context deadline exceeded (Client.Timeout exceeded while awaiting headers)
Test and Build / Lint and Test
Error getting sticky disk: ConnectError: [deadline_exceeded] failed to expose and mount sticky disk: failed to get sticky disk: Get "https://api.blacksmith.sh/stickydisks?arch=amd64&installation_model_id=7445&region=us-west&repo_name=simstudioai%2Fsim&stickydisk_key=simstudioai%2Fsim-bun-cache-pull_request&type=stickydisk": context deadline exceeded (Client.Timeout exceeded while awaiting headers)
Test and Build / Build App
Failed to cleanup and commit sticky disk at /home/runner/_work/sim/sim/node_modules: Error: Command failed: sudo umount "/home/runner/_work/sim/sim/node_modules" umount: /home/runner/_work/sim/sim/node_modules: target is busy.
Test and Build / Build App
Unmount failed, retrying (9/10)...
Test and Build / Build App
Unmount failed, retrying (8/10)...
Test and Build / Build App
Unmount failed, retrying (7/10)...
Test and Build / Build App
Unmount failed, retrying (6/10)...
Test and Build / Build App
Unmount failed, retrying (5/10)...
Test and Build / Build App
Unmount failed, retrying (4/10)...
Test and Build / Build App
Unmount failed, retrying (3/10)...
Test and Build / Build App
Unmount failed, retrying (2/10)...
Test and Build / Build App
Unmount failed, retrying (1/10)...

Artifacts

Produced during runtime
Name Size Digest
integration-reports-migrate
6.68 KB
sha256:9b57872db2c9a7cf185d558b69fcb7fc255a04d6c193f2f4590385c712aee667
integration-reports-push
6.69 KB
sha256:c97823645d8efd099bd1bd251ed4b99730231bd7ce2eea5b5151ea5a4eddd6cf