fix(search): retire legacy embeddings through scoped backfill #33605
ci.yml
on: pull_request
Detect Version
Detect Desktop Changes
Prepare Trigger.dev
Matrix: Build AMD64
Matrix: Build Dev ECR
Matrix: Build ARM64 (GHCR Only)
Matrix: Test and Build / oauth-postgres
Test and Build
/
Lint and Test
8m 10s
Test and Build
/
Build App
3m 44s
Check Docs Changes
Migrate Dev DB
/
Apply Database Migrations
Matrix: Create GHCR Manifests
Process Docs
/
Process Documentation Embeddings
Promote Trigger.dev
Prune Desktop Prereleases
Matrix: Attest Images
Desktop Release
/
Build, Sign, Notarize
Annotations
8 errors and 8 warnings
|
Test and Build / Lint and Test
Process completed with exit code 1.
|
|
lib/knowledge/documents/processing-queue.test.ts > processDocumentsWithQueue billing attribution > rejects a knowledge base without a workspace or organization owner:
apps/sim/lib/knowledge/documents/processing-queue.test.ts#L146
AssertionError: expected [Function] to throw error including 'Document processing requires a worksp…' but got 'Knowledge base knowledge-base-1 not f…'
Expected: "Document processing requires a workspace or organization owner"
Received: "Knowledge base knowledge-base-1 not found for document processing"
❯ lib/knowledge/documents/processing-queue.test.ts:146:5
|
|
lib/knowledge/documents/processing-queue.test.ts > processDocumentsWithQueue billing attribution > rejects mismatched workspace attribution without enqueueing:
apps/sim/lib/knowledge/documents/processing-queue.test.ts#L128
AssertionError: expected [Function] to throw error including 'Document processing workspace does no…' but got 'Knowledge base knowledge-base-1 not f…'
Expected: "Document processing workspace does not match billing attribution"
Received: "Knowledge base knowledge-base-1 not found for document processing"
❯ lib/knowledge/documents/processing-queue.test.ts:128:5
|
|
lib/knowledge/documents/processing-queue.test.ts > processDocumentsWithQueue billing attribution > rejects missing workspace attribution without enqueueing:
apps/sim/lib/knowledge/documents/processing-queue.test.ts#L105
AssertionError: expected [Function] to throw error including 'Workspace document processing require…' but got 'Knowledge base knowledge-base-1 not f…'
Expected: "Workspace document processing requires a billing attribution snapshot"
Received: "Knowledge base knowledge-base-1 not found for document processing"
❯ lib/knowledge/documents/processing-queue.test.ts:105:5
|
|
lib/knowledge/documents/document-processing-source.test.ts > in-process quota continuation dispatch > keeps a claimed direct dispatch accepted when quota continuation handoff fails:
apps/sim/lib/knowledge/documents/document-processing-source.test.ts#L1225
AssertionError: expected undefined to match object { processingStatus: 'failed', …(1) }
- Expected:
{
"processingDeferredUntil": null,
"processingStatus": "failed",
}
+ Received:
undefined
❯ lib/knowledge/documents/document-processing-source.test.ts:1225:26
|
|
lib/knowledge/documents/document-processing-source.test.ts > in-process quota continuation dispatch > durably defers quota exhaustion in direct mode before reporting acceptance:
apps/sim/lib/knowledge/documents/document-processing-source.test.ts#L1134
AssertionError: expected "vi.fn()" to be called with arguments: [ ObjectContaining{…} ]
Number of calls: 0
❯ lib/knowledge/documents/document-processing-source.test.ts:1134:35
|
|
Test and Build / Lint and Test
@sim/app#test: command (/home/runner/_work/sim/sim/apps/sim) /home/runner/.bun/bin/bun run test exited (1)
|
|
Test and Build / Lint and Test
Process completed with exit code 1.
|
|
Test and Build / Lint and Test
Skipping sticky disk commit due to previous step failures
|
|
Test and Build / Lint and Test
Found 2 failed/cancelled steps in previous workflow steps
|
|
Test and Build / Lint and Test
Skipping sticky disk commit due to previous step failures
|
|
Test and Build / Lint and Test
Found 2 failed/cancelled steps in previous workflow steps
|
|
Test and Build / Lint and Test
Skipping sticky disk commit due to previous step failures
|
|
Test and Build / Lint and Test
Found 2 failed/cancelled steps in previous workflow steps
|
|
Test and Build / PostgreSQL integration (migrate)
Node.js 20 is deprecated. The following actions target Node.js 20 but are being forced to run on Node.js 24: actions/upload-artifact@ea165f8d65b6e75b540449e92b4886f43607fa02. For more information see: https://github.blog/changelog/2025-09-19-deprecation-of-node-20-on-github-actions-runners/
|
|
Test and Build / PostgreSQL integration (push)
Node.js 20 is deprecated. The following actions target Node.js 20 but are being forced to run on Node.js 24: actions/upload-artifact@ea165f8d65b6e75b540449e92b4886f43607fa02. For more information see: https://github.blog/changelog/2025-09-19-deprecation-of-node-20-on-github-actions-runners/
|
Artifacts
Produced during runtime
| Name | Size | Digest | |
|---|---|---|---|
|
integration-reports-migrate
|
64.7 KB |
sha256:732806d6b31cbb3c3ae70a17f6b1139b2b9d667629014c04bfc993a94f5158f4
|
|
|
integration-reports-push
|
65.6 KB |
sha256:bbc40b6c917d9a49e5e174bc1c03e5dfb9165e63e58e98f246bd5ee591606994
|
|