feat(emails): introduce Desktop, CLI, and MCP newsletter #33387
ci.yml
on: pull_request
Detect Version
Detect Desktop Changes
Prepare Trigger.dev
Matrix: Build AMD64
Matrix: Build Dev ECR
Matrix: Build ARM64 (GHCR Only)
Matrix: Test and Build / oauth-postgres
Test and Build
/
Lint and Test
6m 46s
Test and Build
/
Build App
4m 46s
Check Docs Changes
Migrate Dev DB
/
Apply Database Migrations
Matrix: Create GHCR Manifests
Process Docs
/
Process Documentation Embeddings
Promote Trigger.dev
0s
Prune Desktop Prereleases
0s
Matrix: Attest Images
Desktop Release
/
Build, Sign, Notarize
Annotations
6 errors and 8 warnings
|
Test and Build / Lint and Test
Process completed with exit code 1.
|
|
lib/sim-search/live/application.test.ts > authorized live retrieval > rejects a read cancelled with a TimeoutError instead of returning partial discussion coverage:
apps/sim/lib/sim-search/live/application.test.ts#L538
AssertionError: expected Error: Drive does not allow downloading t… { …(3) } to be DOMException{ stack: 'TimeoutError: …' } // Object.is equality
- Expected
+ Received
- TimeoutError {
- "message": "The operation timed out.",
+ NativeSearchError {
+ "message": "Drive does not allow downloading this file. Ask the owner to allow downloads or open the source.",
+ "status": "unavailable",
+ "retryAfterSeconds": undefined,
+ "httpStatus": undefined,
}
❯ lib/sim-search/live/application.test.ts:538:7
|
|
lib/sim-search/live/application.test.ts > authorized live retrieval > rejects a read cancelled with an AbortError instead of returning partial discussion coverage:
apps/sim/lib/sim-search/live/application.test.ts#L538
AssertionError: expected Error: Drive does not allow downloading t… { …(3) } to be DOMException{ stack: 'AbortError: Th…' } // Object.is equality
- Expected
+ Received
- AbortError {
- "message": "The operation was aborted.",
+ NativeSearchError {
+ "message": "Drive does not allow downloading this file. Ask the owner to allow downloads or open the source.",
+ "status": "unavailable",
+ "retryAfterSeconds": undefined,
+ "httpStatus": undefined,
}
❯ lib/sim-search/live/application.test.ts:538:7
|
|
lib/sim-search/live/application.test.ts > authorized live retrieval > rejects a read cancelled with a stop reason instead of returning partial discussion coverage:
apps/sim/lib/sim-search/live/application.test.ts#L538
AssertionError: expected Error: Drive does not allow downloading t… { …(3) } to be 'user_stop:test' // Object.is equality
- Expected:
"user_stop:test"
+ Received:
NativeSearchError {
"message": "Drive does not allow downloading this file. Ask the owner to allow downloads or open the source.",
"status": "unavailable",
"retryAfterSeconds": undefined,
"httpStatus": undefined,
}
❯ lib/sim-search/live/application.test.ts:538:7
|
|
Test and Build / Lint and Test
@sim/app#test: command (/home/runner/_work/sim/sim/apps/sim) /home/runner/.bun/bin/bun run test exited (1)
|
|
Test and Build / Lint and Test
Process completed with exit code 1.
|
|
Test and Build / Lint and Test
Skipping sticky disk commit due to previous step failures
|
|
Test and Build / Lint and Test
Found 2 failed/cancelled steps in previous workflow steps
|
|
Test and Build / Lint and Test
Skipping sticky disk commit due to previous step failures
|
|
Test and Build / Lint and Test
Found 2 failed/cancelled steps in previous workflow steps
|
|
Test and Build / Lint and Test
Skipping sticky disk commit due to previous step failures
|
|
Test and Build / Lint and Test
Found 2 failed/cancelled steps in previous workflow steps
|
|
Test and Build / PostgreSQL integration (push)
Node.js 20 is deprecated. The following actions target Node.js 20 but are being forced to run on Node.js 24: actions/upload-artifact@ea165f8d65b6e75b540449e92b4886f43607fa02. For more information see: https://github.blog/changelog/2025-09-19-deprecation-of-node-20-on-github-actions-runners/
|
|
Test and Build / PostgreSQL integration (migrate)
Node.js 20 is deprecated. The following actions target Node.js 20 but are being forced to run on Node.js 24: actions/upload-artifact@ea165f8d65b6e75b540449e92b4886f43607fa02. For more information see: https://github.blog/changelog/2025-09-19-deprecation-of-node-20-on-github-actions-runners/
|
Artifacts
Produced during runtime
| Name | Size | Digest | |
|---|---|---|---|
|
integration-reports-migrate
|
61.3 KB |
sha256:02c1dc2f655abfbe5754a1ce629f4b9211e3988daab813b1b5d1b202ebcabcfe
|
|
|
integration-reports-push
|
61.9 KB |
sha256:4e326071ad04923ec2fdea83605a541502d509129d9175c1cb13e974b1fe8832
|
|